{"text_format":"1","workbook":"xlsx","n_sheets":4,"sheets":["Introduction","Comparison","Futures-options","LRP"],"not_rendered":{"charts":1,"images":10,"macros":1,"external_links":1,"defined_names":4,"comments":1,"pivot_tables":0},"unopened":[],"bounds":{"document_bytes":16777216,"sheet_cells":100000,"rows_first":2000,"rows_last":500,"rows_between":2000,"halvings":0,"cell_chars":16384,"cell_head_chars":4096},"cells_cut":0,"cells_raw":0,"read":"whole","date_system":"1900"}

{"sheet":"Introduction","index":0,"n_rows":55,"n_cols":12,"rows_kept":55,"cut":false,"hidden":false,"merged":[[48,1,48,3],[48,6,48,8],[52,1,53,11],[54,1,55,11],[30,1,30,4],[32,1,36,11],[41,2,41,4],[41,8,41,11],[42,1,43,11],[47,15,47,16],[4,1,5,8],[4,13,5,23],[7,2,7,3],[7,4,7,5],[7,13,8,13],[28,1,29,11]]}
[]
[]
[null,"KSU-Feeder Cattle Risk Management Tool"]
[]
[null,"An Excel spreadsheet for evaluating feeder cattle risk management strategies"]
[]
[]
[null,null,null,null,null,null,null,null,null,null,null,"Version- 4.24.2019"]
[]
[]
[]
[]
[]
[]
[]
[]
[]
[]
[]
[]
[]
[]
[]
[]
[]
[]
[]
[null,"INTRODUCTION"]
[null,"This spreadsheet was developed as a decision-aid tool for producers interested in managing feeder cattle price risk. It can be used to compare the Expected Net Selling Price using alternative risk management tools available for pricing feeder cattle."]
[]
[null,"INSTRUCTIONS FOR THE USER:"]
[null,"Be sure to \"Enable Content\" and \"Enable Macros\" for the spreadsheet to function correctly."]
[null,"In the Comparison sheet all blue numbers are input by the user.  All black numbers are calculated using data provided by the user.  The spreadsheet automatically recalculates every time an additional input is entered.  Thus, it is important to wait until all data have been entered and reviewed before interpreting any of the calculated results (i.e., black numbers). Most of the input cells (i.e., blue number) have a red diamond in the upper right hand corner of the cell.  By moving your mouse cursor over this diamond, a brief description of the input will be displayed on the screen.  "]
[]
[]
[]
[]
[]
[]
[null,"FOR MORE INFORMATION:"]
[null,"To learn more about managing price risk and using LRP insurance visit www.AgManager.info or click on the following links:"]
[null,null,"LRP Insurance Information",null,null,null,null,null,"Price Risk Management Information"]
[null,"Updated by:"]
[]
[null,"Glynn T. Tonsor, Ph.D."]
[null,"Agricultural Economist"]
[null,"Department of Agricultural Economics"]
[null,"Kansas State University"]
[null,"gtonsor@k-state.edu"]
[null,"785-532-1518"]
[]
[null,"ACKNOWLEDGEMENTS:"]
[null,"This spreadsheet was originally developed by Kevin Dhuyvetter, Ph.D., Agricultural Economist, Kanasas State University.  The authors gratefully acknowledge funding provided by USDA's Risk Management Agency (RMA) for initial development of this feeder cattle risk management tool."]
[]
[null,"Copyright 2019 AgManager.info, K-State Department of Agricultural Economics"]

{"sheet":"Comparison","index":1,"n_rows":117,"n_cols":17,"rows_kept":117,"cut":false,"hidden":false,"merged":[[41,1,41,5],[39,1,39,7],[3,1,3,6],[8,1,8,6],[18,1,18,3],[18,5,18,7],[4,1,4,6],[5,1,5,6],[6,1,6,6],[14,1,14,6],[15,1,15,6],[16,1,16,6],[13,1,13,6],[12,1,12,6],[7,1,7,6],[10,1,10,6],[11,1,11,6],[36,1,36,5],[37,1,37,3]]}
[]
[null,"Comparison of Alternative Risk Management Strategies for Pricing Feeder Cattle"]
[]
[null,"Current date",null,null,null,null,null,"2019-04-24",null,null,null,"Futures","LRP","Put","Call","Put","Call"]
[null,{"$f":"\"Number of head (number of head to match futures contract = \"&FIXED(L117/H6,0)&\")\"","v":"Number of head (number of head to match futures contract = 91)"},null,null,null,null,null,90,null,"Number of contracts",null,1,90,1,1,1,1]
[null,{"$f":"\"Expected weight at time of sale, lbs/head -- \"&IF(H6<L115,\"(use weight 1 for LRP)\",\"(use weight 2 for LRP)\")","v":"Expected weight at time of sale, lbs/head -- (use weight 1 for LRP)"},null,null,null,null,null,550,null,"Strike price(s), $/cwt",null,null,164.97,154,164,158,162]
[null,"Pounds of cattle expected to sell in cash market, lbs",null,null,null,null,null,{"$f":"H5*H6","v":49500},null,"Premium, $/cwt",null,null,{"$f":"VLOOKUP(M6,B105:D117,3,1)","v":2.1549999999999998},{"$f":"VLOOKUP(N6,B22:D34,2,1)","v":2.8},{"$f":"VLOOKUP(O6,B22:D34,3,1)","v":4.45},{"$f":"VLOOKUP(P6,B22:D34,2,1)","v":4.2249999999999996},{"$f":"IF(Q6=0,0,VLOOKUP(Q6,B22:D34,3,1))","v":5.3250000000000002}]
[null,"Expected sale date",null,null,null,null,null,"2019-10-09",null,null,null,null,{"$f":"IF(M5>H5,\"Cannot buy LRP for more cattle than owned!\",\"\")","v":""},null,""]
[null,"Feeder cattle type",null,null,null,null,null,"Steers",null,null,"Expected Net Selling Prices"]
[null,null,null,null,null,null,null,null,null,"Futures",null,null,null,null,"Hedge"]
[null,"CME futures contract for hedging (Jan, Mar, Apr, May, Aug, Sep, Oct, Nov)",null,null,null,null,null,"Oct",null,"price","Cash","Hedge","LRP","Put","&Call","Put&Call"]
[null,"Commission for roundtrip (sell and buy) futures trade, $/contract",null,null,null,null,null,60,null,120,{"$f":"J12+H$15","v":143.28},{"$f":"IF(L$5=0,\"n/a\",(K12/100*H$7+((H$14-J12)*L$117/100-H$12)*L$5)/H$7*100)","v":184.82545454545456},{"$f":"IF(OR(M$5=0,M$5>H$5),\"n/a\",(K12/100*H$7-M$7*H$6/100*M$5+IF(M$6>J12*L$113,(M$6-J12*L$113)*H$6/100*M$5,0))/H$7*100)","v":174.09499999999997},{"$f":"IF(N$5=0,\"n/a\",(K12/100*H$7-(N$7*L$117/100+H$13)*N$5+IF(N$6>J12,((N$6-J12)*L$117/100-H$13)*N$5))/H$7*100)","v":174.67393939393941},{"$f":"IF(O$5=0,\"n/a\",(K12/100*H$7+((H$14-J12)*L$117/100-H$12)*L$5-(O$7*L$117/100+H$13)*O$5+IF(J12>O$6,((J12-O$6)*L$117/100-H$13)*O$5,0))/H$7*100)","v":180.26989898989899},{"$f":"IF(SUM(P$5:Q$5)=0,\"n/a\",(K12/100*H$7-(P$7*L$117/100+H$13)*P$5+(Q$7*L$117/100-H$13)*Q$5+IF(P$6>J12,((P$6-J12)*L$117/100-H$13)*P$5)-IF(Q$6<J12,((J12-Q$6)*L$117/100+H$13)*Q$5))/H$7*100)","v":182.59313131313132},{"$f":"MAX(K12:P12)","v":184.82545454545456}]
[null,"Commission to buy or sell options contract, $/contract",null,null,null,null,null,30,null,{"$f":"+J12+J$21","v":130},153.28,184.72444444444443,{"$f":"IF(OR(M$5=0,M$5>H$5),\"n/a\",(K13/100*H$7-M$7*H$6/100*M$5+IF(M$6>J13*L$113,(M$6-J13*L$113)*H$6/100*M$5,0))/H$7*100)","v":173.09499999999994},{"$f":"IF(N$5=0,\"n/a\",(K13/100*H$7-(N$7*L$117/100+H$13)*N$5+IF(N$6>J13,((N$6-J13)*L$117/100-H$13)*N$5))/H$7*100)","v":174.57292929292927},180.16888888888886,{"$f":"IF(SUM(P$5:Q$5)=0,\"n/a\",(K13/100*H$7-(P$7*L$117/100+H$13)*P$5+(Q$7*L$117/100-H$13)*Q$5+IF(P$6>J13,((P$6-J13)*L$117/100-H$13)*P$5)-IF(Q$6<J13,((J13-Q$6)*L$117/100+H$13)*Q$5))/H$7*100)","v":182.49212121212119},{"$f":"MAX(K13:P13)","v":184.72444444444443}]
[null,{"$f":"\"Futures price -- \"&H11&\" CME feeder cattle contract, $/cwt*\"","v":"Futures price -- Oct CME feeder cattle contract, $/cwt*"},null,null,null,null,null,161.25,null,140,163.28,184.62343434343435,172.095,174.4719191919192,180.06787878787881,182.39111111111112,184.62343434343435]
[null,{"$f":"\"Expected basis (cash - \"&H11&\" CME futures), $/cwt#\"","v":"Expected basis (cash - Oct CME futures), $/cwt#"},null,null,null,null,null,23.28,null,150,173.28,184.52242424242425,171.125,174.37090909090912,179.96686868686871,182.29010101010101,184.52242424242425]
[null,"LRP expected ending value for relevant time period^",null,null,null,null,null,177.34100000000001,null,160,183.28,184.42141414141415,181.125,180.39111111111112,179.8658585858586,184.26989898989902,184.42141414141415]
[null,"End date for LRP contract",null,null,null,null,null,"2019-10-22",null,170,193.28,184.32040404040407,191.125,190.39111111111114,185.7648484848485,186.12848484848485,193.28]
[null,null,null,null,null,null,null,null,null,180,203.28,184.21939393939394,201.12499999999994,200.39111111111109,195.76484848484847,186.02747474747471,203.28]
[null,"CME feeder cattle option premiums",null,null,null,"LRP coverage levels and premiums",null,null,null,190,213.28,184.11838383838386,211.125,210.39111111111112,205.76484848484847,185.92646464646464,213.28]
[null,"Strike price","Put","Call",null,"Coverage Level",null,"LRP cost",null,200,223.28,184.01737373737376,221.12500000000003,220.39111111111112,215.7648484848485,185.82545454545456,223.28]
[null,"$/cwt","$/cwt","$/cwt",null,"$/cwt","-%-   ","$/cwt",null,10,"<= futures price increment",null,null,null,null,null,"Signifies maximum price in row   "]
[null,{"$f":"B23-2","v":150},null,null,null,173.77,{"$f":"F22/H$16","v":0.97986365251126362},5.2939999999999996]
[null,152,2.2250000000000001,11.4,null,{"$f":"ROUND(F22-M$113,3)","v":171.57},{"$f":"F23/H$16","v":0.9674581738007566},null,null,null,"Cash","Futures Hedge",{"$f":"\"LRP, ($\"&FIXED(M6,0)&\")\"","v":"LRP, ($165)"},{"$f":"\"Put, ($\"&FIXED(N6,0)&\")\"","v":"Put, ($154)"},{"$f":"\"Hedge & Call, ($\"&FIXED(O6,0)&\")\"","v":"Hedge & Call, ($164)"},{"$f":"\"Put & Call, ($\"&FIXED(P6,0)&\"/$\"&FIXED(Q6,0)&\")\"","v":"Put & Call, ($158/$162)"}]
[null,154,2.8,9.9749999999999996,null,{"$f":"ROUND(F23-M$113,3)","v":169.37},0.95505269509024981]
[null,156,3.4750000000000001,8.6750000000000007,null,167.17,0.94264721637974291]
[null,158,4.2249999999999996,7.45,null,164.97,0.93024173766923601,2.1549999999999998]
[null,160,5.0999999999999996,6.35,null,162.77000000000001,0.91783625895872922]
[null,{"$f":"EVEN(ROUND(H14,0))","v":162},6.0750000000000002,5.3250000000000002,null,160.57,0.90543078024822232]
[null,{"$f":"B28+2","v":164},7.1749999999999998,4.45,null,158.37,0.89302530153771542]
[null,166,8.4250000000000007,3.7,null,156.16999999999999,0.88061982282720852]
[null,168,9.7750000000000004,3.1,null,153.97,0.86821434411670162]
[null,170,11.25,2.5750000000000002,null,151.77000000000001,0.85580886540619483]
[null,172,null,null,null,149.57,0.84340338669568793]
[null,174,null,null,null,{"$f":"ROUND(F33-M$113,3)","v":147.37},0.83099790798518103]
[]
[null," # Websites with information on feeder cattle basis"]
[null,"http://www.agmanager.info/livestock/marketing/graphs/"]
[null,"http://www.beefbasis.com/"]
[null," * Website with futures prices and option premium quotes"]
[null,"http://www.cmegroup.com/trading/agricultural/livestock/feeder-cattle_quotes_globex_options.html"]
[null," ^ Website with LRP coverage levels and premiums"]
[null,"https://www3.rma.usda.gov/apps/livestock_reports/"]
[]
[null,"FeederCattleRiskMgmtTool.xls"]
[null,null,null,null,null,"Updated by:","Glynn T. Tonsor, PhD"]
[null,null,null,null,null,"Developed by:","Kevin C. Dhuyvetter, PhD"]
[]
[]
[]
[]
[]
[]
[]
[]
[]
[]
[]
[]
[]
[]
[]
[]
[]
[]
[]
[]
[]
[]
[]
[]
[]
[]
[]
[]
[]
[]
[]
[]
[]
[]
[]
[]
[]
[]
[]
[]
[]
[]
[]
[]
[]
[]
[]
[]
[]
[]
[]
[]
[]
[]
[null,"Data/information used in formulas above -- do not delete!"]
[]
[null,"LRP coverage level",null,"LRP cost",null,null,null,null,null,null,null,"Price","Price"]
[null,"$/cwt","-%-   ","$/cwt",null,"Feeder cattle type",null,"Type",null,"Weight","Factor","Adj.","Inc."]
[null,{"$f":"F34","v":147.37},{"$f":"B105/H$16","v":0.83099790798518103},{"$f":"IF(H34=0,\"n/a\",H34)","v":"n/a"},null,"Steers","Weight 1",{"$f":"IF(H$9=F105,1,0)","v":1},null,{"$f":"IF(H$6<L$115,1,0)","v":1},{"$f":"H105*J105","v":1},1.1000000000000001,2.2000000000000002]
[null,{"$f":"F33","v":149.57},0.84340338669568793,{"$f":"IF(H33=0,\"n/a\",H33)","v":"n/a"},null,"Steers","Weight 2",1,null,{"$f":"IF(H$6>=L$115,1,0)","v":0},{"$f":"H106*J106","v":0},1,2]
[null,{"$f":"F32","v":151.77000000000001},0.85580886540619483,{"$f":"IF(H32=0,\"n/a\",H32)","v":"n/a"},null,"Heifers","Weight 1",0,null,{"$f":"IF(H$6<L$115,1,0)","v":1},0,1,2]
[null,{"$f":"F31","v":153.97},0.86821434411670162,{"$f":"IF(H31=0,\"n/a\",H31)","v":"n/a"},null,"Heifers","Weight 2",0,null,{"$f":"IF(H$6>=L$115,1,0)","v":0},0,0.9,1.8]
[null,{"$f":"F30","v":156.16999999999999},0.88061982282720852,{"$f":"IF(H30=0,\"n/a\",H30)","v":"n/a"},null,"Braham","Weight 1",0,null,{"$f":"IF(H$6<L$115,1,0)","v":1},0,1,2]
[null,{"$f":"F29","v":158.37},0.89302530153771542,{"$f":"IF(H29=0,\"n/a\",H29)","v":"n/a"},null,"Braham","Weigh 2",0,null,{"$f":"IF(H$6>=L$115,1,0)","v":0},0,0.9,1.8]
[null,{"$f":"F28","v":160.57},0.90543078024822232,{"$f":"IF(H28=0,\"n/a\",H28)","v":"n/a"},null,"Dairy","Weight 1",0,null,{"$f":"IF(H$6<L$115,1,0)","v":1},0,1,1.7]
[null,{"$f":"F27","v":162.77000000000001},0.91783625895872922,{"$f":"IF(H27=0,\"n/a\",H27)","v":"n/a"},null,"Dairy","Weight 2",0,null,{"$f":"IF(H$6>=L$115,1,0)","v":0},0,0.8,1.6]
[null,{"$f":"F26","v":164.97},0.93024173766923601,{"$f":"IF(H26=0,\"n/a\",H26)","v":2.1549999999999998},null,"LRP adjustment factor used in formulas",null,null,null,null,null,{"$f":"SUMPRODUCT(K105:K112,L105:L112)","v":1.1000000000000001},{"$f":"SUMPRODUCT(K105:K112,M105:M112)","v":2.2000000000000002}]
[null,{"$f":"F25","v":167.17},0.94264721637974291,{"$f":"IF(H25=0,\"n/a\",H25)","v":"n/a"}]
[null,{"$f":"F24","v":169.37},0.95505269509024981,{"$f":"IF(H24=0,\"n/a\",H24)","v":"n/a"},null,"Minimum weight for Wt2",null,null,null,null,null,600]
[null,{"$f":"F23","v":171.57},0.9674581738007566,{"$f":"IF(H23=0,\"n/a\",H23)","v":"n/a"},null,"Maximum weight for Wt2",null,null,null,null,null,900]
[null,{"$f":"F22","v":173.77},0.97986365251126362,{"$f":"IF(H22=0,\"n/a\",H22)","v":5.2939999999999996},null,"Pounds per feeder cattle futures contract",null,null,null,null,null,50000]

{"sheet":"Futures-options","index":2,"n_rows":49,"n_cols":2,"rows_kept":49,"cut":false,"hidden":false,"merged":[[47,1,47,12],[1,1,1,12],[48,1,48,12],[2,1,2,12]]}
[]
[null,"Example screen from CME website showing prices for 4/23/2019 for feeder cattle futures contracts"]
[null,"http://www.cmegroup.com/trading/agricultural/livestock/feeder-cattle.html"]
[]
[]
[]
[]
[]
[]
[]
[]
[]
[]
[]
[]
[]
[]
[]
[]
[]
[]
[]
[]
[]
[]
[]
[]
[]
[]
[]
[]
[]
[]
[]
[]
[]
[]
[]
[]
[]
[]
[]
[]
[]
[]
[]
[]
[null,"Example screen from CME website showing option premiums for 4/23/2019 for OCT 2019 feeder cattle contract"]
[null,"http://www.cmegroup.com/trading/agricultural/livestock/feeder-cattle_quotes_globex_options.html"]

{"sheet":"LRP","index":3,"n_rows":79,"n_cols":15,"rows_kept":79,"cut":false,"hidden":false,"merged":[[77,1,77,14],[78,1,78,14],[79,1,79,14],[70,1,70,14],[71,1,71,14],[72,1,72,14],[73,1,73,14],[74,1,74,14],[75,1,75,14],[66,1,66,14],[67,1,67,14],[68,1,68,14],[69,1,69,14],[76,1,76,14],[1,7,1,14],[40,8,40,14]]}
[]
[null,"Example INPUT screen for LRP premiums",null,null,null,null,null,"https://public.rma.usda.gov/livestockreports/main.aspx"]
[]
[]
[]
[]
[]
[]
[]
[]
[]
[]
[]
[]
[]
[]
[]
[]
[]
[]
[]
[]
[]
[]
[]
[]
[]
[]
[]
[]
[]
[]
[]
[]
[]
[]
[]
[]
[]
[]
[null,"Example OUTPUT screen for LRP premiums",null,null,null,null,null,null,"https://public.rma.usda.gov/livestockreports/main.aspx"]
[]
[null,"State","County","Endorsement Length","Commodity","Type","Practice","Crop Year","Exp. End Value","Coverage Price","Coverage Level","Rate","Cost Per CWT","End Date","Actual End Value"]
[null,"20 Kansas","998 All Counties",13,"0801 Feeder Cattle","809 Steers Weight 1","997 No Practice Specified",2019,174.08500000000001,170.02,0.97660000000000002,1.8193999999999998E-2,3.093,"2019-07-23"]
[null,"20 Kansas","998 All Counties",13,"0801 Feeder Cattle","809 Steers Weight 1","997 No Practice Specified",2019,174.08500000000001,167.82,0.96399999999999997,1.3528999999999999E-2,2.27,"2019-07-23"]
[null,"20 Kansas","998 All Counties",13,"0801 Feeder Cattle","809 Steers Weight 1","997 No Practice Specified",2019,174.08500000000001,165.62,0.95140000000000002,9.7040000000000008E-3,1.607,"2019-07-23"]
[null,"20 Kansas","998 All Counties",13,"0801 Feeder Cattle","809 Steers Weight 1","997 No Practice Specified",2019,174.08500000000001,163.41999999999999,0.93869999999999998,6.8320000000000004E-3,1.1160000000000001,"2019-07-23"]
[null,"20 Kansas","998 All Counties",13,"0801 Feeder Cattle","809 Steers Weight 1","997 No Practice Specified",2019,174.08500000000001,161.22,0.92610000000000003,4.7489999999999997E-3,0.76600000000000001,"2019-07-23"]
[null,"20 Kansas","998 All Counties",13,"0801 Feeder Cattle","809 Steers Weight 1","997 No Practice Specified",2019,174.08500000000001,159.02000000000001,0.91349999999999998,3.0920000000000001E-3,0.49199999999999999,"2019-07-23"]
[null,"20 Kansas","998 All Counties",13,"0801 Feeder Cattle","809 Steers Weight 1","997 No Practice Specified",2019,174.08500000000001,156.82,0.90080000000000005,1.9780000000000002E-3,0.31,"2019-07-23"]
[null,"20 Kansas","998 All Counties",13,"0801 Feeder Cattle","809 Steers Weight 1","997 No Practice Specified",2019,174.08500000000001,152.41999999999999,0.87549999999999994,7.2900000000000005E-4,0.111,"2019-07-23"]
[null,"20 Kansas","998 All Counties",17,"0801 Feeder Cattle","809 Steers Weight 1","997 No Practice Specified",2019,175.58099999999999,171.51,0.9768,2.0466000000000002E-2,3.51,"2019-08-20"]
[null,"20 Kansas","998 All Counties",17,"0801 Feeder Cattle","809 Steers Weight 1","997 No Practice Specified",2019,175.58099999999999,169.31,0.96430000000000005,1.5897999999999999E-2,2.6920000000000002,"2019-08-20"]
[null,"20 Kansas","998 All Counties",17,"0801 Feeder Cattle","809 Steers Weight 1","997 No Practice Specified",2019,175.58099999999999,167.11,0.95179999999999998,1.2005999999999999E-2,2.0059999999999998,"2019-08-20"]
[null,"20 Kansas","998 All Counties",17,"0801 Feeder Cattle","809 Steers Weight 1","997 No Practice Specified",2019,175.58099999999999,164.91,0.93920000000000003,8.9510000000000006E-3,1.476,"2019-08-20"]
[null,"20 Kansas","998 All Counties",17,"0801 Feeder Cattle","809 Steers Weight 1","997 No Practice Specified",2019,175.58099999999999,162.71,0.92669999999999997,6.6249999999999998E-3,1.0780000000000001,"2019-08-20"]
[null,"20 Kansas","998 All Counties",17,"0801 Feeder Cattle","809 Steers Weight 1","997 No Practice Specified",2019,175.58099999999999,160.51,0.91420000000000001,4.653E-3,0.747,"2019-08-20"]
[null,"20 Kansas","998 All Counties",17,"0801 Feeder Cattle","809 Steers Weight 1","997 No Practice Specified",2019,175.58099999999999,158.31,0.90159999999999996,3.2030000000000001E-3,0.50700000000000001,"2019-08-20"]
[null,"20 Kansas","998 All Counties",17,"0801 Feeder Cattle","809 Steers Weight 1","997 No Practice Specified",2019,175.58099999999999,153.91,0.87660000000000005,1.415E-3,0.218,"2019-08-20"]
[null,"20 Kansas","998 All Counties",21,"0801 Feeder Cattle","809 Steers Weight 1","997 No Practice Specified",2019,176.54300000000001,172.97,0.9798,2.8701000000000001E-2,4.9640000000000004,"2019-09-17"]
[null,"20 Kansas","998 All Counties",21,"0801 Feeder Cattle","809 Steers Weight 1","997 No Practice Specified",2019,176.54300000000001,164.17,0.92989999999999995,1.1036000000000001E-2,1.8120000000000001,"2019-09-17"]
[null,"20 Kansas","998 All Counties",26,"0801 Feeder Cattle","809 Steers Weight 1","997 No Practice Specified",2019,177.34100000000001,173.77,0.97989999999999999,3.0467999999999999E-2,5.2939999999999996,"2019-10-22"]
[null,"20 Kansas","998 All Counties",26,"0801 Feeder Cattle","809 Steers Weight 1","997 No Practice Specified",2019,177.34100000000001,164.97,0.93020000000000003,1.3063E-2,2.1549999999999998,"2019-10-22"]
[null,"20 Kansas","998 All Counties",30,"0801 Feeder Cattle","809 Steers Weight 1","997 No Practice Specified",2019,177.239,169.4,0.95579999999999998,2.3442000000000001E-2,3.9710000000000001,"2019-11-19"]
[null,"20 Kansas","998 All Counties",30,"0801 Feeder Cattle","809 Steers Weight 1","997 No Practice Specified",2019,177.239,160.6,0.90610000000000002,1.0082000000000001E-2,1.619,"2019-11-19"]
[]
[null,"Notes:"]
[null,"- Some endorsement lengths may not be available due to insufficient pricing or rating information."]
[null,"- For LRP Fed Cattle, Feeder Cattle and Swine, sales open from the time sales data is available (approximately 3:30 P.M. central time) until 9 A.M. central time the"]
[null,"  next day."]
[null,"- For Lamb, sales available MONDAY ONLY. Sales open from the time of official release of coverage prices and rates on Monday morning (approximately 10 A.M."]
[null,"  central time) until 7 P.M. central time Monday."]
[null,"- For Lamb, preliminary coverage prices and rates may be available for viewing Friday evening and over the weekend but are subject to change at the official"]
[null,"  release time on Monday. Coverage prices and rates may also be available for viewing following sales during the week."]
[null,"- Purchase of LRP must be made through an authorized livestock insurance agent."]
[null,"- For LRP Fed Cattle, Feeder Cattle, and Swine, coverage levels and rates shown are available only on the selected effective date until 9 a.m. the following day."]
[null,"- For LRP Lamb, coverage levels and rates shown are available only on the selected effective date until 7 p.m."]
[null,"- For the Formatted Print option, Adobe Acrobat is required. For unformatted printing, use the File->Print option from your browser menu."]
[null,"- Use landscape mode when doing unformatted printing for best results."]